Reaction Details
TargetCarbonic anhydrase 12
LigandBDBM50171199
Substrate/Competitorn/a
Meas. Tech.ChEMBL_1576951 (CHEMBL3806794)
Ki 2.2±n/a nM
Citation Chandak, NCeruso, MSupuran, CTSharma, PK Novel sulfonamide bearing coumarin scaffolds as selective inhibitors of tumor associated carbonic anhydrase isoforms IX and XII. Bioorg Med Chem24:2882-2886 (2016) 
 
Carbonic anhydrase 12
Name:Carbonic anhydrase 12
Type:Enzyme
Mol. Mass.:39456.00
Organism:Homo sapiens (Human)
Description:Catalytic domain of human cloned isozyme was used in the assay
Residue:354
BDBM50171199
NameBDBM50171199
Synonyms:CHEMBL2316106
TypeSmall organic molecule
Emp. Form.C18H11N3O4S2
Mol. Mass.397.428
SMILESNS(=O)(=O)c1ccc2c(c1)sc1nc(cn21)-c1cc2ccccc2oc1=O