Reaction Details
TargetCarbonic anhydrase 1
LigandBDBM50171200
Substrate/Competitorn/a
Meas. Tech.ChEMBL_1576948 (CHEMBL3806791)
Ki 23±n/a nM
Citation Chandak, NCeruso, MSupuran, CTSharma, PK Novel sulfonamide bearing coumarin scaffolds as selective inhibitors of tumor associated carbonic anhydrase isoforms IX and XII. Bioorg Med Chem24:2882-2886 (2016) 
 
Carbonic anhydrase 1
Name:Carbonic anhydrase 1
Type:Enzyme
Mol. Mass.:28873.37
Organism:Homo sapiens (Human)
Description:P00915
Residue:261
BDBM50171200
NameBDBM50171200
Synonyms:CHEMBL2316107
TypeSmall organic molecule
Emp. Form.C18H10ClN3O4S2
Mol. Mass.431.873
SMILESNS(=O)(=O)c1ccc2c(c1)sc1nc(cn21)-c1cc2cc(Cl)ccc2oc1=O