Reaction Details
TargetCarbonic anhydrase 1
LigandBDBM50171190
Substrate/Competitorn/a
Meas. Tech.ChEMBL_1576948 (CHEMBL3806791)
Ki 263±n/a nM
Citation Chandak, NCeruso, MSupuran, CTSharma, PK Novel sulfonamide bearing coumarin scaffolds as selective inhibitors of tumor associated carbonic anhydrase isoforms IX and XII. Bioorg Med Chem24:2882-2886 (2016) 
 
Carbonic anhydrase 1
Name:Carbonic anhydrase 1
Type:Enzyme
Mol. Mass.:28873.37
Organism:Homo sapiens (Human)
Description:P00915
Residue:261
BDBM50171190
NameBDBM50171190
Synonyms:CHEMBL3804902
TypeSmall organic molecule
Emp. Form.C28H19FN6O4S2
Mol. Mass.586.617
SMILESNS(=O)(=O)c1ccc(cc1)-n1cc(\C=N/Nc2nc(cs2)-c2cc3ccccc3oc2=O)c(n1)-c1ccc(F)cc1