Reaction Details
TargetTyrosine-protein kinase receptor UFO
LigandBDBM50248510
Substrate/Competitorn/a
Meas. Tech.ChEMBL_1580717 (CHEMBL3811322)
IC50 7.0±n/a nM
Citation Myers, SHBrunton, VGUnciti-Broceta, A AXL Inhibitors in Cancer: A Medicinal Chemistry Perspective. J Med Chem59:3593-608 (2016) 
 
Tyrosine-protein kinase receptor UFO
Name:Tyrosine-protein kinase receptor UFO
Type:Enzyme
Mol. Mass.:98316.97
Organism:Homo sapiens (Human)
Description:P30530
Residue:894
BDBM50248510
NameBDBM50248510
Synonyms:CHEMBL489326 | N-(4-(6,7-dimethoxyquinolin-4-yloxy)-3-fluorophenyl)-N-(4-fluorophenyl)cyclopropane-1,1-dicarboxamide
TypeSmall organic molecule
Emp. Form.C28H23F2N3O5
Mol. Mass.519.4961
SMILESCOc1cc2nccc(Oc3ccc(NC(=O)C4(CC4)C(=O)Nc4ccc(F)cc4)cc3F)c2cc1OC