Reaction Details
TargetVascular endothelial growth factor receptor 2
LigandBDBM50248510
Substrate/Competitorn/a
Meas. Tech.ChEMBL_1580736 (CHEMBL3811341)
IC50 1.9±n/a nM
Citation Myers, SHBrunton, VGUnciti-Broceta, A AXL Inhibitors in Cancer: A Medicinal Chemistry Perspective. J Med Chem59:3593-608 (2016) 
 
Vascular endothelial growth factor receptor 2
Name:Vascular endothelial growth factor receptor 2
Type:Receptor Tyrosine Kinase
Mol. Mass.:151510.97
Organism:Homo sapiens (Human)
Description:P35968
Residue:1356
BDBM50248510
NameBDBM50248510
Synonyms:CHEMBL489326 | N-(4-(6,7-dimethoxyquinolin-4-yloxy)-3-fluorophenyl)-N-(4-fluorophenyl)cyclopropane-1,1-dicarboxamide
TypeSmall organic molecule
Emp. Form.C28H23F2N3O5
Mol. Mass.519.4961
SMILESCOc1cc2nccc(Oc3ccc(NC(=O)C4(CC4)C(=O)Nc4ccc(F)cc4)cc3F)c2cc1OC