Reaction Details
TargetTyrosine-protein phosphatase non-receptor type 1
LigandBDBM50148911
Substrate/Competitorn/a
Meas. Tech.ChEMBL_1581173 (CHEMBL3810646)
IC50 5200±n/a nM
Citation Ji, SLi, ZSong, WWang, YLiang, WLi, KTang, SWang, QQiao, XZhou, DYu, SYe, M Bioactive Constituents of Glycyrrhiza uralensis (Licorice): Discovery of the Effective Components of a Traditional Herbal Medicine. J Nat Prod79:281-92 (2016) 
 
Tyrosine-protein phosphatase non-receptor type 1
Name:Tyrosine-protein phosphatase non-receptor type 1
Type:Protein phosphatase
Mol. Mass.:49963.76
Organism:Homo sapiens (Human)
Description:Human recombinant GST-fusion PTP1B (1-435).
Residue:435
BDBM50148911
NameBDBM50148911
Synonyms:(3beta)-3-hydroxyurs-12-en-28-oic acid CHEMBL169 malol urson
TypeSmall organic molecule
Emp. Form.C30H48O3
Mol. Mass.456.7003
SMILESC[C@@H]1CC[C@@]2(CC[C@]3(C)C(=CC[C@@H]4[C@@]5(C)CC[C@H](O)C(C)(C)[C@@H]5CC[C@@]34C)[C@@H]2[C@H]1C)C(O)=O