Reaction Details
TargetGlutaminase kidney isoform, mitochondrial
LigandBDBM50172181
Substrate/Competitorn/a
Meas. Tech.ChEMBL_1579150 (CHEMBL3811870)
IC50 0.390000±n/a nM
Citation Abdel-Magid, AF Glutaminase GLS1 Inhibitors as Potential Cancer Treatment. ACS Med Chem Lett7:207-8 (2016) 
 
Glutaminase kidney isoform, mitochondrial
Name:Glutaminase kidney isoform, mitochondrial
Type:Protein
Mol. Mass.:73471.89
Organism:Homo sapiens (Human)
Description:O94925
Residue:669
BDBM50172181
NameBDBM50172181
Synonyms:CHEMBL3810394 US10294221, Example 3
TypeSmall organic molecule
Emp. Form.C18H20N8O2S
Mol. Mass.412.469
SMILESCO[C@H](C(=O)Nc1nnc(N[C@@H]2CCN(C2)c2cncnn2)s1)c1ccccc1