Reaction Details
TargetEpidermal growth factor receptor
LigandBDBM50172492
Substrate/Competitorn/a
Meas. Tech.ChEMBL_1580794 (CHEMBL3811753)
IC50 15±n/a nM
Citation Daydé-Cazals, BFauvel, BSinger, MFeneyrolles, CBestgen, BGassiot, FSpenlinhauer, AWarnault, PVan Hijfte, NBorjini, NChevé, GYasri, A Rational Design, Synthesis, and Biological Evaluation of 7-Azaindole Derivatives as Potent Focused Multi-Targeted Kinase Inhibitors. J Med Chem59:3886-905 (2016) 
 
Epidermal growth factor receptor
Name:Epidermal growth factor receptor
Type:Receptor Kinase Domain
Mol. Mass.:134279.59
Organism:Homo sapiens (Human)
Description:P00533
Residue:1210
BDBM50172492
NameBDBM50172492
Synonyms:CHEMBL3808884
TypeSmall organic molecule
Emp. Form.C29H25F3N6O3
Mol. Mass.562.5424
SMILESCOC(=O)c1cc2cc(NCc3cc(NC(=O)c4cc(cc(c4)C(F)(F)F)-n4cnc(C)c4)ccc3C)cnc2[nH]1