Reaction Details
TargetProstaglandin G/H synthase 1
LigandBDBM13066
Substrate/Competitorn/a
Meas. Tech.ChEMBL_1578589 (CHEMBL3811630)
IC50 70±n/a nM
Citation Singh, PKaur, SKaur, JSingh, GBhatti, R Rational Design of Small Peptides for Optimal Inhibition of Cyclooxygenase-2: Development of a Highly Effective Anti-Inflammatory Agent. J Med Chem59:3920-34 (2016) 
 
Prostaglandin G/H synthase 1
Name:Prostaglandin G/H synthase 1
Type:Protein
Mol. Mass.:68868.60
Organism:Ovis aries (Sheep)
Description:n/a
Residue:600
BDBM13066
NameBDBM13066
Synonyms:2-{2-[(2,6-dichlorophenyl)amino]phenyl}acetic acid Diclofenac US11478464, Compound Diclofenac {2-[(2,6-dichlorophenyl)amino]phenyl}acetic acid
TypeSmall organic molecule
Emp. Form.C14H11Cl2NO2
Mol. Mass.296.149
SMILESOC(=O)Cc1ccccc1Nc1c(Cl)cccc1Cl