Reaction Details
TargetAlpha-1A adrenergic receptor
LigandBDBM50172993
Substrate/Competitorn/a
Meas. Tech.ChEMBL_1579180 (CHEMBL3812083)
IC50 38±n/a nM
Citation Zhao, FLi, JChen, YTian, YWu, CXie, YZhou, YWang, JXie, XLiu, H Design, Synthesis, and Biological Evaluation of Indoline and Indole Derivatives as Potent and Selectivea1A-Adrenoceptor Antagonists. J Med Chem59:3826-39 (2016) 
 
Alpha-1A adrenergic receptor
Name:Alpha-1A adrenergic receptor
Type:Cell-surface receptors
Mol. Mass.:51511.67
Organism:Homo sapiens (Human)
Description:P35348
Residue:466
BDBM50172993
NameBDBM50172993
Synonyms:CHEMBL3810187
TypeSmall organic molecule
Emp. Form.C27H36F3N3O4
Mol. Mass.523.5876
SMILESCCc1ccc(OCC(F)(F)F)c(OCCNC(C)Cc2cc3CCN(CCCO)c3c(c2)C(N)=O)c1