Reaction Details
TargetAlpha-1A adrenergic receptor
LigandBDBM50173001
Substrate/Competitorn/a
Meas. Tech.ChEMBL_1579180 (CHEMBL3812083)
IC50 26±n/a nM
Citation Zhao, FLi, JChen, YTian, YWu, CXie, YZhou, YWang, JXie, XLiu, H Design, Synthesis, and Biological Evaluation of Indoline and Indole Derivatives as Potent and Selectivea1A-Adrenoceptor Antagonists. J Med Chem59:3826-39 (2016) 
 
Alpha-1A adrenergic receptor
Name:Alpha-1A adrenergic receptor
Type:Cell-surface receptors
Mol. Mass.:51511.67
Organism:Homo sapiens (Human)
Description:P35348
Residue:466
BDBM50173001
NameBDBM50173001
Synonyms:CHEMBL3810198
TypeSmall organic molecule
Emp. Form.C25H35N3O3
Mol. Mass.425.5637
SMILESCCc1ccccc1OCCNC(C)Cc1cc2CCN(CCCO)c2c(c1)C(N)=O