Reaction Details
TargetAlpha-1D adrenergic receptor
LigandBDBM50173101
Substrate/Competitorn/a
Meas. Tech.ChEMBL_1579182 (CHEMBL3812085)
IC50 16±n/a nM
Citation Zhao, FLi, JChen, YTian, YWu, CXie, YZhou, YWang, JXie, XLiu, H Design, Synthesis, and Biological Evaluation of Indoline and Indole Derivatives as Potent and Selectivea1A-Adrenoceptor Antagonists. J Med Chem59:3826-39 (2016) 
 
Alpha-1D adrenergic receptor
Name:Alpha-1D adrenergic receptor
Type:Enzyme Catalytic Domain
Mol. Mass.:60485.82
Organism:Homo sapiens (Human)
Description:adrenergic Alpha1D ADRA1D HUMAN::P25100
Residue:572
BDBM50173101
NameBDBM50173101
Synonyms:CHEMBL3808572
TypeSmall organic molecule
Emp. Form.C25H30F3N3O4
Mol. Mass.493.5186
SMILESCC(Cc1cc(C(N)=O)c2n(CCCO)ccc2c1)NCCOc1ccccc1OCC(F)(F)F