Reaction Details
TargetAlpha-1B adrenergic receptor
LigandBDBM50173101
Substrate/Competitorn/a
Meas. Tech.ChEMBL_1579181 (CHEMBL3812084)
IC50 180±n/a nM
Citation Zhao, FLi, JChen, YTian, YWu, CXie, YZhou, YWang, JXie, XLiu, H Design, Synthesis, and Biological Evaluation of Indoline and Indole Derivatives as Potent and Selectivea1A-Adrenoceptor Antagonists. J Med Chem59:3826-39 (2016) 
 
Alpha-1B adrenergic receptor
Name:Alpha-1B adrenergic receptor
Type:Enzyme
Mol. Mass.:56862.13
Organism:Homo sapiens (Human)
Description:P35368
Residue:520
BDBM50173101
NameBDBM50173101
Synonyms:CHEMBL3808572
TypeSmall organic molecule
Emp. Form.C25H30F3N3O4
Mol. Mass.493.5186
SMILESCC(Cc1cc(C(N)=O)c2n(CCCO)ccc2c1)NCCOc1ccccc1OCC(F)(F)F