Reaction Details
TargetAlpha-1B adrenergic receptor
LigandBDBM50173000
Substrate/Competitorn/a
Meas. Tech.ChEMBL_1579181 (CHEMBL3812084)
IC50 5992±n/a nM
Citation Zhao, FLi, JChen, YTian, YWu, CXie, YZhou, YWang, JXie, XLiu, H Design, Synthesis, and Biological Evaluation of Indoline and Indole Derivatives as Potent and Selectivea1A-Adrenoceptor Antagonists. J Med Chem59:3826-39 (2016) 
 
Alpha-1B adrenergic receptor
Name:Alpha-1B adrenergic receptor
Type:Enzyme
Mol. Mass.:56862.13
Organism:Homo sapiens (Human)
Description:P35368
Residue:520
BDBM50173000
NameBDBM50173000
Synonyms:CHEMBL3808878
TypeSmall organic molecule
Emp. Form.C24H33N3O3
Mol. Mass.411.5371
SMILESCC(Cc1cc2CCN(CCCO)c2c(c1)C(N)=O)NCCOc1ccccc1C