Reaction Details
TargetAlpha-1A adrenergic receptor
LigandBDBM50173115
Substrate/Competitorn/a
Meas. Tech.ChEMBL_1579180 (CHEMBL3812083)
IC50 2.2±n/a nM
Citation Zhao, FLi, JChen, YTian, YWu, CXie, YZhou, YWang, JXie, XLiu, H Design, Synthesis, and Biological Evaluation of Indoline and Indole Derivatives as Potent and Selectivea1A-Adrenoceptor Antagonists. J Med Chem59:3826-39 (2016) 
 
Alpha-1A adrenergic receptor
Name:Alpha-1A adrenergic receptor
Type:Cell-surface receptors
Mol. Mass.:51511.67
Organism:Homo sapiens (Human)
Description:P35348
Residue:466
BDBM50173115
NameBDBM50173115
Synonyms:CHEMBL3809840
TypeSmall organic molecule
Emp. Form.C26H32F3N3O4
Mol. Mass.507.5452
SMILESCC(Cc1cc(C(N)=O)c2n(CCCO)ccc2c1)NCCOc1cc(C)ccc1OCC(F)(F)F