Reaction Details
TargetAlpha-1A adrenergic receptor
LigandBDBM50172996
Substrate/Competitorn/a
Meas. Tech.ChEMBL_1579180 (CHEMBL3812083)
IC50 17±n/a nM
Citation Zhao, FLi, JChen, YTian, YWu, CXie, YZhou, YWang, JXie, XLiu, H Design, Synthesis, and Biological Evaluation of Indoline and Indole Derivatives as Potent and Selectivea1A-Adrenoceptor Antagonists. J Med Chem59:3826-39 (2016) 
 
Alpha-1A adrenergic receptor
Name:Alpha-1A adrenergic receptor
Type:Cell-surface receptors
Mol. Mass.:51511.67
Organism:Homo sapiens (Human)
Description:P35348
Residue:466
BDBM50172996
NameBDBM50172996
Synonyms:CHEMBL3808717
TypeSmall organic molecule
Emp. Form.C27H34F3N3O4
Mol. Mass.521.5718
SMILESCCc1ccc(OCC(F)(F)F)c(OCCNC(C)Cc2cc(C(N)=O)c3n(CCCO)ccc3c2)c1