Reaction Details
TargetAlpha-1A adrenergic receptor
LigandBDBM50173112
Substrate/Competitorn/a
Meas. Tech.ChEMBL_1579180 (CHEMBL3812083)
IC50 0.300000±n/a nM
Citation Zhao, FLi, JChen, YTian, YWu, CXie, YZhou, YWang, JXie, XLiu, H Design, Synthesis, and Biological Evaluation of Indoline and Indole Derivatives as Potent and Selectivea1A-Adrenoceptor Antagonists. J Med Chem59:3826-39 (2016) 
 
Alpha-1A adrenergic receptor
Name:Alpha-1A adrenergic receptor
Type:Cell-surface receptors
Mol. Mass.:51511.67
Organism:Homo sapiens (Human)
Description:P35348
Residue:466
BDBM50173112
NameBDBM50173112
Synonyms:CHEMBL3810110
TypeSmall organic molecule
Emp. Form.C24H30FN3O4
Mol. Mass.443.5111
SMILESCOc1ccc(F)cc1OCCNC(C)Cc1cc(C(N)=O)c2n(CCCO)ccc2c1