Reaction Details
TargetSodium channel protein type 2 subunit alpha
LigandBDBM50173134
Substrate/Competitorn/a
Meas. Tech.ChEMBL_1579961 (CHEMBL3813478)
IC50 400±n/a nM
Citation Koltun, DOParkhill, EQElzein, EKobayashi, TJiang, RHLi, XPerry, TDAvila, BWang, WQHirakawa, RSmith-Maxwell, CWu, LDhalla, AKRajamani, SMollova, NStafford, BTang, JBelardinelli, LZablocki, JA Discovery of triazolopyridinone GS-462808, a late sodium current inhibitor (Late INai) of the cardiac Nav1.5 channel with improved efficacy and potency relative to ranolazine. Bioorg Med Chem Lett26:3207-11 (2016) 
 
Sodium channel protein type 2 subunit alpha
Name:Sodium channel protein type 2 subunit alpha
Type:Enzyme
Mol. Mass.:227954.68
Organism:Homo sapiens (Human)
Description:Q99250
Residue:2005
BDBM50173134
NameBDBM50173134
Synonyms:CHEMBL3809595
TypeSmall organic molecule
Emp. Form.C14H7F6N3O
Mol. Mass.347.2153
SMILESFC(F)(F)Oc1ccc(cc1)-c1ccc2nnc(n2c1)C(F)(F)F