Reaction Details
TargetHistone-lysine N-methyltransferase SETD7
LigandBDBM50173506
Substrate/Competitorn/a
Meas. Tech.ChEMBL_1580421 (CHEMBL3812774)
IC50 7200±n/a nM
Citation Takemoto, YIto, ANiwa, HOkamura, MFujiwara, THirano, THanda, NUmehara, TSonoda, TOgawa, KTariq, MNishino, NDan, SKagechika, HYamori, TYokoyama, SYoshida, M Identification of Cyproheptadine as an Inhibitor of SET Domain Containing Lysine Methyltransferase 7/9 (Set7/9) That Regulates Estrogen-Dependent Transcription. J Med Chem59:3650-60 (2016) 
 
Histone-lysine N-methyltransferase SETD7
Name:Histone-lysine N-methyltransferase SETD7
Type:Enzyme
Mol. Mass.:40691.12
Organism:Homo sapiens (Human)
Description:Q8WTS6
Residue:366
BDBM50173506
NameBDBM50173506
Synonyms:CHEMBL3809236
TypeSmall organic molecule
Emp. Form.C22H23N
Mol. Mass.301.4247
SMILES[#6]-[#6]-[#7]-1-[#6]-[#6]\[#6](-[#6]-[#6]-1)=[#6]-1/c2ccccc2-[#6]=[#6]-c2ccccc-12