Reaction Details
TargetProthrombin
LigandBDBM32653
Substrate/Competitorn/a
Meas. Tech.ChEMBL_1580947 (CHEMBL3812615)
Ki 180±n/a nM
Citation Gunaydin, HBartberger, MD Stacking with No Planarity? ACS Med Chem Lett7:341-4 (2016) 
 
Prothrombin
Name:Prothrombin
Type:Protein
Mol. Mass.:70029.57
Organism:Homo sapiens (Human)
Description:P00734
Residue:622
BDBM32653
NameBDBM32653
Synonyms:m-chlorobenzylamide, 2
TypeSmall organic molecule
Emp. Form.C21H24ClN3O2
Mol. Mass.385.887
SMILESN[C@H](Cc1ccccc1)C(=O)N1CCCC1C(=O)NCc1cccc(Cl)c1