Reaction Details
TargetVascular endothelial growth factor receptor 2
LigandBDBM50173586
Substrate/Competitorn/a
Meas. Tech.ChEMBL_1580960 (CHEMBL3812628)
IC50 1.000000±n/a nM
Citation Mainolfi, NPowers, JMeredith, EElliott, JGunderson, KGPoor, SLiu, FAnderson, K Core Replacements in a Potent Series of VEGFR-2 Inhibitors and Their Impact on Potency, Solubility, and hERG. ACS Med Chem Lett7:357-62 (2016) 
 
Vascular endothelial growth factor receptor 2
Name:Vascular endothelial growth factor receptor 2
Type:Receptor Tyrosine Kinase
Mol. Mass.:151510.97
Organism:Homo sapiens (Human)
Description:P35968
Residue:1356
BDBM50173586
NameBDBM50173586
Synonyms:CHEMBL3808921
TypeSmall organic molecule
Emp. Form.C24H21F3N6O3
Mol. Mass.498.4571
SMILESC[C@H]1Cc2c(CN1)ncnc2Oc1ccc2n(ccc2c1)C(=O)Nc1cc(on1)C1(CC1)C(F)(F)F