Reaction Details
TargetDelta-type opioid receptor
LigandBDBM50173991
Substrate/Competitorn/a
Meas. Tech.ChEMBL_1581401 (CHEMBL3812008)
EC50 1000±n/a nM
Citation Shen, QQian, YHuang, XXu, XLi, WLiu, JFu, W Discovery of Potent and Selective Agonists ofd Opioid Receptor by Revisiting the"Message-Address" Concept. ACS Med Chem Lett7:391-6 (2016) 
 
Delta-type opioid receptor
Name:Delta-type opioid receptor
Type:G Protein-Coupled Receptor (GPCR)
Mol. Mass.:40382.98
Organism:Homo sapiens (Human)
Description:Competition binding assays were carried out using membrane preparations from transfected HN9.10 cells that constitutively expressed the delta opioid receptor.
Residue:372
BDBM50173991
NameBDBM50173991
Synonyms:CHEMBL3809323
TypeSmall organic molecule
Emp. Form.C26H26F3NO3
Mol. Mass.457.4847
SMILESCN(C)C[C@H]1CCc2cc(ccc2[C@]1(O)c1cccc(O)c1)-c1ccccc1OC(F)(F)F