Reaction Details
TargetKappa-type opioid receptor
LigandBDBM50173990
Substrate/Competitorn/a
Meas. Tech.ChEMBL_1581398 (CHEMBL3812005)
Ki>10000±n/a nM
Citation Shen, QQian, YHuang, XXu, XLi, WLiu, JFu, W Discovery of Potent and Selective Agonists ofd Opioid Receptor by Revisiting the"Message-Address" Concept. ACS Med Chem Lett7:391-6 (2016) 
 
Kappa-type opioid receptor
Name:Kappa-type opioid receptor
Type:G Protein-Coupled Receptor (GPCR)
Mol. Mass.:42648.76
Organism:Homo sapiens (Human)
Description:P41145
Residue:380
BDBM50173990
NameBDBM50173990
Synonyms:CHEMBL3808766
TypeSmall organic molecule
Emp. Form.C26H29NO3
Mol. Mass.403.5134
SMILESCOc1ccccc1-c1ccc2c(CCC(CN(C)C)C2(O)c2cccc(O)c2)c1