Reaction Details
TargetKappa-type opioid receptor
LigandBDBM50173994
Substrate/Competitorn/a
Meas. Tech.ChEMBL_1581398 (CHEMBL3812005)
Ki>10000±n/a nM
Citation Shen, QQian, YHuang, XXu, XLi, WLiu, JFu, W Discovery of Potent and Selective Agonists ofd Opioid Receptor by Revisiting the"Message-Address" Concept. ACS Med Chem Lett7:391-6 (2016) 
 
Kappa-type opioid receptor
Name:Kappa-type opioid receptor
Type:G Protein-Coupled Receptor (GPCR)
Mol. Mass.:42648.76
Organism:Homo sapiens (Human)
Description:P41145
Residue:380
BDBM50173994
NameBDBM50173994
Synonyms:CHEMBL3809684
TypeSmall organic molecule
Emp. Form.C25H26FNO2
Mol. Mass.391.4778
SMILESCN(C)C[C@H]1CCc2cc(ccc2[C@]1(O)c1cccc(O)c1)-c1ccccc1F