Reaction Details
TargetKappa-type opioid receptor
LigandBDBM50174071
Substrate/Competitorn/a
Meas. Tech.ChEMBL_1581398 (CHEMBL3812005)
Ki>10000±n/a nM
Citation Shen, QQian, YHuang, XXu, XLi, WLiu, JFu, W Discovery of Potent and Selective Agonists ofd Opioid Receptor by Revisiting the"Message-Address" Concept. ACS Med Chem Lett7:391-6 (2016) 
 
Kappa-type opioid receptor
Name:Kappa-type opioid receptor
Type:G Protein-Coupled Receptor (GPCR)
Mol. Mass.:42648.76
Organism:Homo sapiens (Human)
Description:P41145
Residue:380
BDBM50174071
NameBDBM50174071
Synonyms:CHEMBL3808800
TypeSmall organic molecule
Emp. Form.C26H26F3NO2
Mol. Mass.441.4853
SMILESCN(C)C[C@H]1CCc2cc(ccc2[C@]1(O)c1cccc(O)c1)-c1ccc(cc1)C(F)(F)F