Reaction Details
TargetDelta-type opioid receptor
LigandBDBM50174032
Substrate/Competitorn/a
Meas. Tech.ChEMBL_1581396 (CHEMBL3812003)
Ki 4.7±n/a nM
Citation Shen, QQian, YHuang, XXu, XLi, WLiu, JFu, W Discovery of Potent and Selective Agonists ofd Opioid Receptor by Revisiting the"Message-Address" Concept. ACS Med Chem Lett7:391-6 (2016) 
 
Delta-type opioid receptor
Name:Delta-type opioid receptor
Type:G Protein-Coupled Receptor (GPCR)
Mol. Mass.:40382.98
Organism:Homo sapiens (Human)
Description:Competition binding assays were carried out using membrane preparations from transfected HN9.10 cells that constitutively expressed the delta opioid receptor.
Residue:372
BDBM50174032
NameBDBM50174032
Synonyms:CHEMBL3808835
TypeSmall organic molecule
Emp. Form.C26H29NO3
Mol. Mass.403.5134
SMILESCOc1ccccc1-c1ccc2c(CC[C@H](CN(C)C)[C@@]2(O)c2cccc(O)c2)c1