Reaction Details
TargetDelta-type opioid receptor
LigandBDBM50174104
Substrate/Competitorn/a
Meas. Tech.ChEMBL_1581396 (CHEMBL3812003)
Ki>10000±n/a nM
Citation Shen, QQian, YHuang, XXu, XLi, WLiu, JFu, W Discovery of Potent and Selective Agonists ofd Opioid Receptor by Revisiting the"Message-Address" Concept. ACS Med Chem Lett7:391-6 (2016) 
 
Delta-type opioid receptor
Name:Delta-type opioid receptor
Type:G Protein-Coupled Receptor (GPCR)
Mol. Mass.:40382.98
Organism:Homo sapiens (Human)
Description:Competition binding assays were carried out using membrane preparations from transfected HN9.10 cells that constitutively expressed the delta opioid receptor.
Residue:372
BDBM50174104
NameBDBM50174104
Synonyms:CHEMBL3809145
TypeSmall organic molecule
Emp. Form.C27H28F3NO2
Mol. Mass.455.5119
SMILESCOc1cccc(c1)[C@]1(O)[C@@H](CN(C)C)CCc2cc(ccc12)-c1ccc(cc1)C(F)(F)F