Reaction Details
TargetMu-type opioid receptor
LigandBDBM50173993
Substrate/Competitorn/a
Meas. Tech.ChEMBL_1581394 (CHEMBL3812001)
Ki>10000±n/a nM
Citation Shen, QQian, YHuang, XXu, XLi, WLiu, JFu, W Discovery of Potent and Selective Agonists ofd Opioid Receptor by Revisiting the"Message-Address" Concept. ACS Med Chem Lett7:391-6 (2016) 
 
Mu-type opioid receptor
Name:Mu-type opioid receptor
Type:G Protein-Coupled Receptor (GPCR)
Mol. Mass.:44789.51
Organism:Homo sapiens (Human)
Description:P35372
Residue:400
BDBM50173993
NameBDBM50173993
Synonyms:CHEMBL3809017
TypeSmall organic molecule
Emp. Form.C25H26ClNO2
Mol. Mass.407.932
SMILESCN(C)C[C@H]1CCc2cc(ccc2[C@]1(O)c1cccc(O)c1)-c1ccccc1Cl