Reaction Details
TargetMu-type opioid receptor
LigandBDBM50174103
Substrate/Competitorn/a
Meas. Tech.ChEMBL_1581394 (CHEMBL3812001)
Ki>10000±n/a nM
Citation Shen, QQian, YHuang, XXu, XLi, WLiu, JFu, W Discovery of Potent and Selective Agonists ofd Opioid Receptor by Revisiting the"Message-Address" Concept. ACS Med Chem Lett7:391-6 (2016) 
 
Mu-type opioid receptor
Name:Mu-type opioid receptor
Type:G Protein-Coupled Receptor (GPCR)
Mol. Mass.:44789.51
Organism:Homo sapiens (Human)
Description:P35372
Residue:400
BDBM50174103
NameBDBM50174103
Synonyms:CHEMBL3809687
TypeSmall organic molecule
Emp. Form.C26H28ClNO2
Mol. Mass.421.959
SMILESCOc1cccc(c1)[C@]1(O)[C@@H](CN(C)C)CCc2cc(ccc12)-c1ccc(Cl)cc1