Reaction Details
TargetCarbonic anhydrase 9
LigandBDBM50174348
Substrate/Competitorn/a
Meas. Tech.ChEMBL_1581000 (CHEMBL3812832)
Ki 49±n/a nM
Citation Kumar, SCeruso, MTuccinardi, TSupuran, CTSharma, PK Pyrazolylbenzo[d]imidazoles as new potent and selective inhibitors of carbonic anhydrase isoforms hCA IX and XII. Bioorg Med Chem24:2907-2913 (2016) 
 
Carbonic anhydrase 9
Name:Carbonic anhydrase 9
Type:Enzyme
Mol. Mass.:49669.03
Organism:Homo sapiens (Human)
Description:Catalytic domain of human cloned isozyme was used in the assay
Residue:459
BDBM50174348
NameBDBM50174348
Synonyms:CHEMBL3810298
TypeSmall organic molecule
Emp. Form.C23H19N5O2S
Mol. Mass.429.494
SMILESCc1ccc(cc1)-c1nn(cc1-c1nc2ccccc2[nH]1)-c1ccc(cc1)S(N)(=O)=O