Reaction Details
TargetCarbonic anhydrase 12
LigandBDBM50174441
Substrate/Competitorn/a
Meas. Tech.ChEMBL_1581001 (CHEMBL3813006)
Ki 7.6±n/a nM
Citation Kumar, SCeruso, MTuccinardi, TSupuran, CTSharma, PK Pyrazolylbenzo[d]imidazoles as new potent and selective inhibitors of carbonic anhydrase isoforms hCA IX and XII. Bioorg Med Chem24:2907-2913 (2016) 
 
Carbonic anhydrase 12
Name:Carbonic anhydrase 12
Type:Enzyme
Mol. Mass.:39456.00
Organism:Homo sapiens (Human)
Description:Catalytic domain of human cloned isozyme was used in the assay
Residue:354
BDBM50174441
NameBDBM50174441
Synonyms:CHEMBL3809086
TypeSmall organic molecule
Emp. Form.C22H16BrN5O2S
Mol. Mass.494.364
SMILESNS(=O)(=O)c1ccc(cc1)-n1cc(-c2nc3ccccc3[nH]2)c(n1)-c1ccc(Br)cc1