Reaction Details
TargetCarbonic anhydrase 2
LigandBDBM50174441
Substrate/Competitorn/a
Meas. Tech.ChEMBL_1580999 (CHEMBL3812831)
Ki 1.9±n/a nM
Citation Kumar, SCeruso, MTuccinardi, TSupuran, CTSharma, PK Pyrazolylbenzo[d]imidazoles as new potent and selective inhibitors of carbonic anhydrase isoforms hCA IX and XII. Bioorg Med Chem24:2907-2913 (2016) 
 
Carbonic anhydrase 2
Name:Carbonic anhydrase 2
Type:Enzyme
Mol. Mass.:29250.71
Organism:Homo sapiens (Human)
Description:P00918
Residue:260
BDBM50174441
NameBDBM50174441
Synonyms:CHEMBL3809086
TypeSmall organic molecule
Emp. Form.C22H16BrN5O2S
Mol. Mass.494.364
SMILESNS(=O)(=O)c1ccc(cc1)-n1cc(-c2nc3ccccc3[nH]2)c(n1)-c1ccc(Br)cc1