Reaction Details
TargetCarbonic anhydrase 1
LigandBDBM50174418
Substrate/Competitorn/a
Meas. Tech.ChEMBL_1580998 (CHEMBL3812830)
Ki>40000±n/a nM
Citation Kumar, SCeruso, MTuccinardi, TSupuran, CTSharma, PK Pyrazolylbenzo[d]imidazoles as new potent and selective inhibitors of carbonic anhydrase isoforms hCA IX and XII. Bioorg Med Chem24:2907-2913 (2016) 
 
Carbonic anhydrase 1
Name:Carbonic anhydrase 1
Type:Enzyme
Mol. Mass.:28873.37
Organism:Homo sapiens (Human)
Description:P00915
Residue:261
BDBM50174418
NameBDBM50174418
Synonyms:CHEMBL3613524
TypeSmall organic molecule
Emp. Form.C22H15FN4
Mol. Mass.354.3797
SMILESFc1ccc(cc1)-c1nn(cc1-c1nc2ccccc2[nH]1)-c1ccccc1