Reaction Details
TargetCarbonic anhydrase 1
LigandBDBM50174349
Substrate/Competitorn/a
Meas. Tech.ChEMBL_1580998 (CHEMBL3812830)
Ki 33550±n/a nM
Citation Kumar, SCeruso, MTuccinardi, TSupuran, CTSharma, PK Pyrazolylbenzo[d]imidazoles as new potent and selective inhibitors of carbonic anhydrase isoforms hCA IX and XII. Bioorg Med Chem24:2907-2913 (2016) 
 
Carbonic anhydrase 1
Name:Carbonic anhydrase 1
Type:Enzyme
Mol. Mass.:28873.37
Organism:Homo sapiens (Human)
Description:P00915
Residue:261
BDBM50174349
NameBDBM50174349
Synonyms:CHEMBL3809848
TypeSmall organic molecule
Emp. Form.C22H15BrN4
Mol. Mass.415.285
SMILESBrc1ccc(cc1)-c1nn(cc1-c1nc2ccccc2[nH]1)-c1ccccc1