Reaction Details
TargetCarbonic anhydrase 2
LigandBDBM50176460
Substrate/Competitorn/a
Meas. Tech.ChEMBL_1579080 (CHEMBL3811428)
Ki 0.620000±n/a nM
Citation Abdel Gawad, NMAmin, NHElsaadi, MTMohamed, FMMAngeli, ADe Luca, VCapasso, CSupuran, CT Synthesis of 4-(thiazol-2-ylamino)-benzenesulfonamides with carbonic anhydrase I, II and IX inhibitory activity and cytotoxic effects against breast cancer cell lines. Bioorg Med Chem24:3043-3051 (2016) 
 
Carbonic anhydrase 2
Name:Carbonic anhydrase 2
Type:Enzyme
Mol. Mass.:29250.71
Organism:Homo sapiens (Human)
Description:P00918
Residue:260
BDBM50176460
NameBDBM50176460
Synonyms:CHEMBL3808746
TypeSmall organic molecule
Emp. Form.C16H14N4O4S2
Mol. Mass.390.437
SMILESNS(=O)(=O)c1ccc(Nc2nc(Nc3ccc(cc3)C(O)=O)cs2)cc1