Reaction Details
TargetCarbonic anhydrase 2
LigandBDBM50176724
Substrate/Competitorn/a
Meas. Tech.ChEMBL_1579080 (CHEMBL3811428)
Ki 4.4±n/a nM
Citation Abdel Gawad, NMAmin, NHElsaadi, MTMohamed, FMMAngeli, ADe Luca, VCapasso, CSupuran, CT Synthesis of 4-(thiazol-2-ylamino)-benzenesulfonamides with carbonic anhydrase I, II and IX inhibitory activity and cytotoxic effects against breast cancer cell lines. Bioorg Med Chem24:3043-3051 (2016) 
 
Carbonic anhydrase 2
Name:Carbonic anhydrase 2
Type:Enzyme
Mol. Mass.:29250.71
Organism:Homo sapiens (Human)
Description:P00918
Residue:260
BDBM50176724
NameBDBM50176724
Synonyms:CHEMBL3809540
TypeSmall organic molecule
Emp. Form.C16H13N5O5S2
Mol. Mass.419.435
SMILESNS(=O)(=O)c1ccc(NC2=NC(=O)\C(S2)=N\Nc2ccc(cc2)C(O)=O)cc1