Reaction Details
TargetCarbonic anhydrase 2
LigandBDBM50176758
Substrate/Competitorn/a
Meas. Tech.ChEMBL_1579080 (CHEMBL3811428)
Ki 4.1±n/a nM
Citation Abdel Gawad, NMAmin, NHElsaadi, MTMohamed, FMMAngeli, ADe Luca, VCapasso, CSupuran, CT Synthesis of 4-(thiazol-2-ylamino)-benzenesulfonamides with carbonic anhydrase I, II and IX inhibitory activity and cytotoxic effects against breast cancer cell lines. Bioorg Med Chem24:3043-3051 (2016) 
 
Carbonic anhydrase 2
Name:Carbonic anhydrase 2
Type:Enzyme
Mol. Mass.:29250.71
Organism:Homo sapiens (Human)
Description:P00918
Residue:260
BDBM50176758
NameBDBM50176758
Synonyms:CHEMBL3809527
TypeSmall organic molecule
Emp. Form.C15H12ClN5O3S2
Mol. Mass.409.87
SMILESNS(=O)(=O)c1ccc(NC2=NC(=O)\C(S2)=N\Nc2ccc(Cl)cc2)cc1