Reaction Details
TargetInduced myeloid leukemia cell differentiation protein Mcl-1
LigandBDBM50176879
Substrate/Competitorn/a
Meas. Tech.ChEMBL_1581631 (CHEMBL3817394)
Ki>50000±n/a nM
Citation Gowthaman, RMiller, SARogers, SKhowsathit, JLan, LBai, NJohnson, DKLiu, CXu, LAnbanandam, AAubé, JRoy, AKaranicolas, J DARC: Mapping Surface Topography by Ray-Casting for Effective Virtual Screening at Protein Interaction Sites. J Med Chem59:4152-70 (2016) 
 
Induced myeloid leukemia cell differentiation protein Mcl-1
Name:Induced myeloid leukemia cell differentiation protein Mcl-1
Type:Membrane; Single-pass membrane protein
Mol. Mass.:37332.87
Organism:Homo sapiens (Human)
Description:Q07820
Residue:350
BDBM50176879
NameBDBM50176879
Synonyms:CHEMBL3815059
TypeSmall organic molecule
Emp. Form.C19H20O6
Mol. Mass.344.3585
SMILESCOc1ccc(\C=C\C(=O)c2cc(OC)c(OC)c(OC)c2O)cc1