Reaction Details
TargetInduced myeloid leukemia cell differentiation protein Mcl-1
LigandBDBM50176891
Substrate/Competitorn/a
Meas. Tech.ChEMBL_1581631 (CHEMBL3817394)
Ki 10000±n/a nM
Citation Gowthaman, RMiller, SARogers, SKhowsathit, JLan, LBai, NJohnson, DKLiu, CXu, LAnbanandam, AAubé, JRoy, AKaranicolas, J DARC: Mapping Surface Topography by Ray-Casting for Effective Virtual Screening at Protein Interaction Sites. J Med Chem59:4152-70 (2016) 
 
Induced myeloid leukemia cell differentiation protein Mcl-1
Name:Induced myeloid leukemia cell differentiation protein Mcl-1
Type:Membrane; Single-pass membrane protein
Mol. Mass.:37332.87
Organism:Homo sapiens (Human)
Description:Q07820
Residue:350
BDBM50176891
NameBDBM50176891
Synonyms:CHEMBL3813804
TypeSmall organic molecule
Emp. Form.C17H15ClO4
Mol. Mass.318.752
SMILESCOc1ccc(cc1)C(=O)\C=C\c1cc(Cl)c(O)c(OC)c1