Reaction Details
TargetInduced myeloid leukemia cell differentiation protein Mcl-1
LigandBDBM50176901
Substrate/Competitorn/a
Meas. Tech.ChEMBL_1581631 (CHEMBL3817394)
Ki 12000±n/a nM
Citation Gowthaman, RMiller, SARogers, SKhowsathit, JLan, LBai, NJohnson, DKLiu, CXu, LAnbanandam, AAubé, JRoy, AKaranicolas, J DARC: Mapping Surface Topography by Ray-Casting for Effective Virtual Screening at Protein Interaction Sites. J Med Chem59:4152-70 (2016) 
 
Induced myeloid leukemia cell differentiation protein Mcl-1
Name:Induced myeloid leukemia cell differentiation protein Mcl-1
Type:Membrane; Single-pass membrane protein
Mol. Mass.:37332.87
Organism:Homo sapiens (Human)
Description:Q07820
Residue:350
BDBM50176901
NameBDBM50176901
Synonyms:CHEMBL3815029
TypeSmall organic molecule
Emp. Form.C27H30O5
Mol. Mass.434.5241
SMILES[H][C@]12CC[C@@H](OC3(O)C(=O)c4ccccc4C3=O)[C@]1(C)CC[C@@]1([H])[C@]3([H])CCC(=O)C=C3CC[C@]21[H]