Reaction Details
TargetProcathepsin L
LigandBDBM50176994
Substrate/Competitorn/a
Meas. Tech.ChEBML_1582258
EC50 6000±n/a nM
Citation Schneider, PSchneider, G De Novo Design at the Edge of Chaos. J Med Chem59:4077-86 (2016) 
 
Procathepsin L
Name:Procathepsin L
Type:Enzyme
Mol. Mass.:37557.19
Organism:Homo sapiens (Human)
Description:Purchased from Calbiochem (San Diego, CA).
Residue:333
BDBM50176994
NameBDBM50176994
Synonyms:CHEMBL3813784
TypeSmall organic molecule
Emp. Form.C21H23NO5
Mol. Mass.369.411
SMILESO=C(COc1ccccc1)N[C@@H](Cc1ccccc1)C(=O)O[C@H]1CCOC1