Reaction Details
TargetVascular endothelial growth factor receptor 2
LigandBDBM50176996
Substrate/Competitorn/a
Meas. Tech.ChEBML_1582256
Ki 64±n/a nM
Citation Schneider, PSchneider, G De Novo Design at the Edge of Chaos. J Med Chem59:4077-86 (2016) 
 
Vascular endothelial growth factor receptor 2
Name:Vascular endothelial growth factor receptor 2
Type:Receptor Tyrosine Kinase
Mol. Mass.:151510.97
Organism:Homo sapiens (Human)
Description:P35968
Residue:1356
BDBM50176996
NameBDBM50176996
Synonyms:CHEMBL3813969
TypeSmall organic molecule
Emp. Form.C22H20N6O
Mol. Mass.384.4338
SMILESO=C(Nc1ccc(Cn2cncn2)cc1)c1ccccc1NCc1ccncc1