Reaction Details
TargetCytochrome P450 1B1
LigandBDBM50179338
Substrate/Competitorn/a
Meas. Tech.ChEMBL_1583531 (CHEMBL3815618)
IC50 2000±n/a nM
Citation Lee, DPerez, PJackson, WChin, TGalbreath, MFronczek, FRIsovitsch, RIimoto, DS Aryl morpholino triazenes inhibit cytochrome P450 1A1 and 1B1. Bioorg Med Chem Lett26:3243-3247 (2016) 
 
Cytochrome P450 1B1
Name:Cytochrome P450 1B1
Type:PROTEIN
Mol. Mass.:60861.81
Organism:Homo sapiens (Human)
Description:ChEMBL_1474523
Residue:543
BDBM50179338
NameBDBM50179338
Synonyms:CHEMBL3814495
TypeSmall organic molecule
Emp. Form.C10H12N4O3
Mol. Mass.236.2273
SMILES[O-][N+](=O)c1ccc(cc1)\N=N\N1CCOCC1