Reaction Details
TargetEctonucleotide pyrophosphatase/phosphodiesterase family member 1
LigandBDBM50179375
Substrate/Competitorn/a
Meas. Tech.ChEMBL_1583537 (CHEMBL3815624)
Ki 467±n/a nM
Citation Lee, SYPerotti, ADe Jonghe, SHerdewijn, PHanck, TMüller, CE Thiazolo[3,2-a]benzimidazol-3(2H)-one derivatives: Structure-activity relationships of selective nucleotide pyrophosphatase/phosphodiesterase1 (NPP1) inhibitors. Bioorg Med Chem24:3157-65 (2016) 
 
Ectonucleotide pyrophosphatase/phosphodiesterase family member 1
Name:Ectonucleotide pyrophosphatase/phosphodiesterase family member 1
Type:PROTEIN
Mol. Mass.:104934.43
Organism:Homo sapiens (Human)
Description:ChEMBL_1448940
Residue:925
BDBM50179375
NameBDBM50179375
Synonyms:CHEMBL3813806
TypeSmall organic molecule
Emp. Form.C14H7IN2O2S
Mol. Mass.394.187
SMILESIc1ccc(\C=c2/sc3nc4ccccc4n3c2=O)o1