Reaction Details
TargetOxysterols receptor LXR-beta
LigandBDBM19993
Substrate/Competitorn/a
Meas. Tech.ChEMBL_1583942 (CHEMBL3815374)
EC50 410±n/a nM
Citation Koura, MYamaguchi, YKurobuchi, SSumida, HWatanabe, YEnomoto, TMatsuda, TOkuda, AKoshizawa, TMatsumoto, YShibuya, K Discovery of a 2-hydroxyacetophenone derivative as an outstanding linker to enhance potency andß-selectivity of liver X receptor agonist. Bioorg Med Chem24:3436-46 (2016) 
 
Oxysterols receptor LXR-beta
Name:Oxysterols receptor LXR-beta
Type:Enzyme Catalytic Domain
Mol. Mass.:50978.79
Organism:Homo sapiens (Human)
Description:P55055
Residue:460
BDBM19993
NameBDBM19993
Synonyms:CHEMBL62136 T 0901317 TO-901317 US10669296, Compound TO901317 [3H]T0901317
TypeSmall organic molecule
Emp. Form.C17H12F9NO3S
Mol. Mass.481.333
SMILESOC(c1ccc(cc1)N(CC(F)(F)F)S(=O)(=O)c1ccccc1)(C(F)(F)F)C(F)(F)F