Reaction Details
TargetSerine/threonine-protein kinase B-raf
LigandBDBM50179530
Substrate/Competitorn/a
Meas. Tech.ChEMBL_1584020 (CHEMBL3815521)
IC50 1640±n/a nM
Citation Sun, JNiu, YWang, CZhang, HXie, BXu, FJin, HPeng, YLiang, LXu, P Discovery of 3-benzyl-1,3-benzoxazine-2,4-dione analogues as allosteric mitogen-activated kinase kinase (MEK) inhibitors and anti-enterovirus 71 (EV71) agents. Bioorg Med Chem24:3472-82 (2016) 
 
Serine/threonine-protein kinase B-raf
Name:Serine/threonine-protein kinase B-raf
Type:Serine/threonine-protein kinase
Mol. Mass.:84446.00
Organism:Homo sapiens (Human)
Description:P15056
Residue:766
BDBM50179530
NameBDBM50179530
Synonyms:CHEMBL3814758
TypeSmall organic molecule
Emp. Form.C24H21FN4O7S
Mol. Mass.528.51
SMILESCN(C)C(=O)Oc1ccc2c(c1)oc(=O)n(Cc1cccc(NS(=O)(=O)Nc3ccccc3)c1F)c2=O