Reaction Details
TargetSerine/threonine-protein kinase B-raf
LigandBDBM50179651
Substrate/Competitorn/a
Meas. Tech.ChEMBL_1584020 (CHEMBL3815521)
IC50 55±n/a nM
Citation Sun, JNiu, YWang, CZhang, HXie, BXu, FJin, HPeng, YLiang, LXu, P Discovery of 3-benzyl-1,3-benzoxazine-2,4-dione analogues as allosteric mitogen-activated kinase kinase (MEK) inhibitors and anti-enterovirus 71 (EV71) agents. Bioorg Med Chem24:3472-82 (2016) 
 
Serine/threonine-protein kinase B-raf
Name:Serine/threonine-protein kinase B-raf
Type:Serine/threonine-protein kinase
Mol. Mass.:84446.00
Organism:Homo sapiens (Human)
Description:P15056
Residue:766
BDBM50179651
NameBDBM50179651
Synonyms:CHEMBL3814978
TypeSmall organic molecule
Emp. Form.C19H19FN4O7S
Mol. Mass.466.44
SMILESCNS(=O)(=O)Nc1cccc(Cn2c(=O)oc3cc(OC(=O)N(C)C)ccc3c2=O)c1F