Reaction Details
TargetOxytocin receptor
LigandBDBM50180162
Substrate/Competitorn/a
Meas. Tech.ChEMBL_1583333 (CHEMBL3816396)
EC50 0.290000±n/a nM
Citation Sciabola, SGoetz, GHBai, GRogers, BNGray, DLDuplantier, AFonseca, KRVanase-Frawley, MAKablaoui, NM Systematic N-methylation of oxytocin: Impact on pharmacology and intramolecular hydrogen bonding network. Bioorg Med Chem24:3513-20 (2016) 
 
Oxytocin receptor
Name:Oxytocin receptor
Type:Enzyme Catalytic Domain
Mol. Mass.:42793.26
Organism:Homo sapiens (Human)
Description:Oxytocin OXTR HEK293::B2R9L7
Residue:389
BDBM50180162
NameBDBM50180162
Synonyms:CHEMBL3813771
TypeSmall organic molecule
Emp. Form.C44H67N11O12S2
Mol. Mass.1006.199
SMILES[H][C@]1(NC(=O)[C@H](Cc2ccc(O)cc2)NC(=O)CCSSC[C@H](N(C)C(=O)[C@H](CC(N)=O)NC(=O)[C@H](CCC(N)=O)NC1=O)C(=O)N1CCC[C@H]1C(=O)N[C@@H](CC(C)C)C(=O)NCC(N)=O)[C@@H](C)CC