Reaction Details
TargetCarbonic anhydrase 2
LigandBDBM50433836
Substrate/Competitorn/a
Meas. Tech.ChEMBL_1583614 (CHEMBL3815701)
Ki 7.6±n/a nM
Citation Vullo, DSupuran, CTScozzafava, ADe Simone, GMonti, SMAlterio, VCarta, F Kinetic and X-ray crystallographic investigations of substituted 2-thio-6-oxo-1,6-dihydropyrimidine-benzenesulfonamides acting as carbonic anhydrase inhibitors. Bioorg Med Chem24:3643-8 (2016) 
 
Carbonic anhydrase 2
Name:Carbonic anhydrase 2
Type:Enzyme
Mol. Mass.:29250.71
Organism:Homo sapiens (Human)
Description:P00918
Residue:260
BDBM50433836
NameBDBM50433836
Synonyms:CHEMBL2382337
TypeSmall organic molecule
Emp. Form.C19H14ClN5O4S2
Mol. Mass.475.929
SMILESNS(=O)(=O)c1ccc(NC(=O)CSc2nc(-c3ccc(Cl)cc3)c(C#N)c(=O)[nH]2)cc1