Reaction Details
TargetCarbonic anhydrase 1
LigandBDBM50433836
Substrate/Competitorn/a
Meas. Tech.ChEMBL_1583613 (CHEMBL3815700)
Ki 59±n/a nM
Citation Vullo, DSupuran, CTScozzafava, ADe Simone, GMonti, SMAlterio, VCarta, F Kinetic and X-ray crystallographic investigations of substituted 2-thio-6-oxo-1,6-dihydropyrimidine-benzenesulfonamides acting as carbonic anhydrase inhibitors. Bioorg Med Chem24:3643-8 (2016) 
 
Carbonic anhydrase 1
Name:Carbonic anhydrase 1
Type:Enzyme
Mol. Mass.:28873.37
Organism:Homo sapiens (Human)
Description:P00915
Residue:261
BDBM50433836
NameBDBM50433836
Synonyms:CHEMBL2382337
TypeSmall organic molecule
Emp. Form.C19H14ClN5O4S2
Mol. Mass.475.929
SMILESNS(=O)(=O)c1ccc(NC(=O)CSc2nc(-c3ccc(Cl)cc3)c(C#N)c(=O)[nH]2)cc1